{"text_format":"3","workbook":"xlsx","n_sheets":13,"sheets":["DSFA-Erfordernis","DSFA","Risikomatrix","Risikomatrix2","Risikoanalyse","Risiken","Risikobeispiele","Risikoquellen","Risikobewältigung","Maßnahmen","Ergebnis","Risikoberechnung","Ausfüllhilfen"],"not_rendered":{"external_links":2,"defined_names":28},"read":"whole","date_system":"1900"}

{"sheet":"DSFA-Erfordernis","index":0,"n_rows":37,"n_cols":4,"rows_kept":37}
["Verarbeitung Krankenhaus-Informations-System (KIS) „Complete Recovery“","Datum: 13.12.2019"]
[]
["Beurteilung Erforderlichkeit einer Datenschutz-Folgenabschätzung:",{"$f":"IF(SUM(D35:D37)>=1,\"DSFA nicht erforderlich\",IF(SUM(D6:D34)>=1,\"DSFA erforderlich\",\"DSFA nicht erforderlich\"))","v":"DSFA nicht erforderlich"}]
[]
["Frage / Prüfung","Ja/Nein","Ja=0,5","Ja=1"]
["Birgt die Verarbeitung der personenbezogenen Daten ein hohes Risiko für die Rechte und Freiheiten der Betroffenen?",null,null,{"$f":"IF(B6=\"Ja\",1,0)","v":0}]
["Insbesondere prüfen (mehr als 2 Kriterien legen Vermutung nahe, dass DSFA erforderlich ist):"]
["Einsatz neuer Verarbeitungstechnologien, d. h. Technologien, zu denen der Verantwortliche noch keine DSFA durchgeführt hat",null,{"$f":"IF(B8=\"Ja\",0.5,0)","v":0},{"$f":"SUM(C8:C12)","v":0}]
["Einsatz neuer Verarbeitungen, d. h. Verfahren der Verarbeitung personenbezogener Daten, zu denen der Verantwortliche noch keine DSFA durchgeführt hat",null,{"$f":"IF(B9=\"Ja\",0.5,0)","v":0}]
["Verarbeitung großer Datenmengen",null,0]
{"$rows_left_out":28}
{"sheet":"DSFA","index":1,"n_rows":142,"n_cols":23,"rows_kept":142,"merged":[[1,0,1,5],[1,6,1,12],[1,13,1,19]]}
[null,null,"frei",null,"Liste","Liste","Liste","Liste","Formel","Formel","Formel","Liste","frei","Liste","Liste","Formel","Formel","Formel","Liste"]
["Verarbeitungstätigkeit: ",{"$nulls":5},"Riskoanalyse VOR Maßnahmenfestlegung",{"$nulls":6},"Riskoanalyse NACH Maßnahmenfestlegung",{"$nulls":6},"Ergebnis","Summe Bewertung"]
["lfd.\nNr.","Risiko-ursprung","Risiken","Risikobeispiele","Risiko-\nquellen\n","Risiko-\nverantwort-\nlicher","Schadens-höhe","Eintritts-wahrschein-lichkeit","Verkettung","ohne Formel","Risiko-\nbewertung","Risiko-\nbewäl-\ntigung","Maß-\nnahmen","Schadens-höhe","Eintritts-wahrschein-lichkeit","Verkettung","ohne Formel","Risiko-\nbewertung","Risiko-\nbewäl-\ntigung","Maß-\nnahmen",{"$f":"IF(V3>0,\"Weitere Maßnahmen erforderlich, bzw. Aufsichtsbehörde einschalten\",\"Verfahren kann durchgeführt werden\")","v":"Verfahren kann durchgeführt werden"},{"$f":"SUM(W:W)","v":0}]
[null,null,"nach Erwägungsgrund 83 DS-GVO",{"$nulls":3},"- Niedrig\n- Normal\n- Hoch\n- Sehr hoch","- Niedrig\n- Mittel\n- Hoch",null,null,"- Kein Risiko\n- Voraussichtlich kein Risiko\n- (Normales) Risiko\n- Erhebliches Risiko\n- Hohes Risiko\n- untragbares Risiko","Risiko-\n vermeidung,\n minimierung,\n handhabung,\n übertragung,",null,"- Niedrig\n- Normal\n- Hoch\n- Sehr hoch","- Niedrig\n- Mittel\n- Hoch",null,null,"- Kein Risiko\n- Voraussichtlich kein Risiko\n- (Normales) Risiko\n- Erhebliches Risiko\n- Hohes Risiko","Risiko-\n vermeidung,\n minimierung,\n handhabung,\n übertragung,"]
["Nr.",null,"Bitte Auswahl anklicken","Bitte Auswahl anklicken","Bitte Auswahl anklicken","Freitext","Bitte Auswahl \nanklicken","Bitte Auswahl anklicken",null,null,"Kennzeichnung folgt automatisch","Bitte Auswahl anklicken","Bitte Auswahl anklicken","Bitte Auswahl \nanklicken","Bitte Auswahl anklicken",null,null,"Kennzeichnung folgt automatisch","Bitte Auswahl anklicken","Bitte Auswahl anklicken","Bitte Auswahl anklicken","Zähler","Ergebnisbewertung"]
[{"$f":"ROW()-5","v":{"v":1,"d":"1."}},{"$nulls":7},{"$f":"CONCATENATE(G6,H6)","v":""},{"$f":"I6","v":""},{"$f":"IF(ISNA(VLOOKUP(J6,Risikoberechnung!$A$2:$B$13,2,FALSE)),\"x\",VLOOKUP(J6,Risikoberechnung!$A$2:$B$13,2,FALSE))","v":"x"},{"$nulls":4},{"$f":"CONCATENATE(N6,O6)","v":""},{"$f":"P6","v":""},{"$f":"IF(ISNA(VLOOKUP(Q6,Risikoberechnung!$A$2:$B$13,2,FALSE)),\"x\",VLOOKUP(Q6,Risikoberechnung!$A$2:$B$13,2,FALSE))","v":"x"},{"$nulls":3},1,{"$f":"IF(U6=Ergebnis!$C$4,0,(IF(U6=Ergebnis!$C$5,1,\"x\")))","v":"x"}]
[{"$f":"ROW()-5","v":{"v":2,"d":"2."}},{"$nulls":7},{"$f":"CONCATENATE(G7,H7)","v":""},"",{"$f":"IF(ISNA(VLOOKUP(J7,Risikoberechnung!$A$2:$B$13,2,FALSE)),\"x\",VLOOKUP(J7,Risikoberechnung!$A$2:$B$13,2,FALSE))","v":"x"},{"$nulls":4},{"$f":"CONCATENATE(N7,O7)","v":""},"",{"$f":"IF(ISNA(VLOOKUP(Q7,Risikoberechnung!$A$2:$B$13,2,FALSE)),\"x\",VLOOKUP(Q7,Risikoberechnung!$A$2:$B$13,2,FALSE))","v":"x"},{"$nulls":3},1,{"$f":"IF(U7=Ergebnis!$C$4,0,(IF(U7=Ergebnis!$C$5,1,\"x\")))","v":"x"}]
[{"v":3,"d":"3."},{"$nulls":7},"",{"$f":"I8","v":""},{"$f":"IF(ISNA(VLOOKUP(J8,Risikoberechnung!$A$2:$B$13,2,FALSE)),\"x\",VLOOKUP(J8,Risikoberechnung!$A$2:$B$13,2,FALSE))","v":"x"},{"$nulls":4},"","",{"$f":"IF(ISNA(VLOOKUP(Q8,Risikoberechnung!$A$2:$B$13,2,FALSE)),\"x\",VLOOKUP(Q8,Risikoberechnung!$A$2:$B$13,2,FALSE))","v":"x"},{"$nulls":3},1,{"$f":"IF(U8=Ergebnis!$C$4,0,(IF(U8=Ergebnis!$C$5,1,\"x\")))","v":"x"}]
[{"v":4,"d":"4."},{"$nulls":7},{"$f":"CONCATENATE(G9,H9)","v":""},{"$f":"I9","v":""},{"$f":"IF(ISNA(VLOOKUP(J9,Risikoberechnung!$A$2:$B$13,2,FALSE)),\"x\",VLOOKUP(J9,Risikoberechnung!$A$2:$B$13,2,FALSE))","v":"x"},{"$nulls":4},{"$f":"CONCATENATE(N9,O9)","v":""},{"$f":"P9","v":""},{"$f":"IF(ISNA(VLOOKUP(Q9,Risikoberechnung!$A$2:$B$13,2,FALSE)),\"x\",VLOOKUP(Q9,Risikoberechnung!$A$2:$B$13,2,FALSE))","v":"x"},{"$nulls":3},1,{"$f":"IF(U9=Ergebnis!$C$4,0,(IF(U9=Ergebnis!$C$5,1,\"x\")))","v":"x"}]
[{"v":5,"d":"5."},{"$nulls":7},"",{"$f":"I10","v":""},{"$f":"IF(ISNA(VLOOKUP(J10,Risikoberechnung!$A$2:$B$13,2,FALSE)),\"x\",VLOOKUP(J10,Risikoberechnung!$A$2:$B$13,2,FALSE))","v":"x"},{"$nulls":4},"","",{"$f":"IF(ISNA(VLOOKUP(Q10,Risikoberechnung!$A$2:$B$13,2,FALSE)),\"x\",VLOOKUP(Q10,Risikoberechnung!$A$2:$B$13,2,FALSE))","v":"x"},{"$nulls":3},1,{"$f":"IF(U10=Ergebnis!$C$4,0,(IF(U10=Ergebnis!$C$5,1,\"x\")))","v":"x"}]
{"$rows_left_out":133}
{"sheet":"Risikomatrix","index":2,"n_rows":140,"n_cols":23,"rows_kept":140,"merged":[[1,1,1,3],[1,4,1,6],[2,9,2,13],[2,18,2,22],[3,8,11,8],[3,9,5,9],[3,10,5,10],[3,11,5,11],[3,12,5,12],[3,13,5,13],[3,17,11,17],[3,18,5,18],[3,19,5,19],[3,20,5,20],[3,21,5,21],[3,22,5,22],[6,9,8,9],[6,10,8,10],[6,11,8,11],[6,12,8,12],[6,13,8,13],[6,18,8,18],[6,19,8,19],[6,20,8,20],[6,21,8,21],[6,22,8,22],[9,9,11,9],[9,10,11,10],[9,11,11,11],[9,12,11,12],[9,13,11,13],[9,18,11,18],[9,19,11,19],[9,20,11,20],[9,21,11,21],[9,22,11,22],[12,10,14,10],[12,11,14,11],[12,12,14,12],[12,13,14,13],[12,19,14,19],[12,20,14,20],[12,21,14,21],[12,22,14,22],[15,10,15,13],[15,19,15,22],[19,9,19,13],[19,18,19,22],[20,8,28,8],[20,9,22,9],[20,10,22,10],[20,11,22,11],[20,12,22,12],[20,13,22,13],[20,17,28,17],[20,18,22,18],[20,19,22,19],[20,20,22,20],[20,21,22,21],[20,22,22,22],[23,9,25,9],[23,10,25,10],[23,11,25,11],[23,12,25,12],[23,13,25,13],[23,18,25,18],[23,19,25,19],[23,20,25,20],[23,21,25,21],[23,22,25,22],[26,9,28,9],[26,10,28,10],[26,11,28,11],[26,12,28,12],[26,13,28,13],[26,18,28,18],[26,19,28,19],[26,20,28,20],[26,21,28,21],[26,22,28,22],[29,10,31,10],[29,11,31,11],[29,12,31,12],[29,13,31,13],[29,19,31,19],[29,20,31,20],[29,21,31,21],[29,22,31,22],[32,10,32,13],[32,19,32,22]]}
[]
[null,"Vor Maßnahmenplaung",null,null,"nach Maßnahmenplanung"]
["Verfahren/ Prozess","Schaden","Wahrschein-lichkeit","Risikoein-schätzung","Schaden","Wahrschein-lichkeit","Risikoein-schätzung",null,null,"Risikomatrix vor Maßnahmenplanung",{"$nulls":8},"Risikomatrix vor Maßnahmenplanung"]
[{"$f":"DSFA!A6","v":1},{"$f":"IF(ISNA(VLOOKUP(DSFA!G6,Risikoberechnung!$H$2:$I$5,2,FALSE)),\"\",VLOOKUP(DSFA!G6,Risikoberechnung!$H$2:$I$5,2,FALSE))","v":""},{"$f":"IF(ISNA(VLOOKUP(DSFA!H6,Risikoberechnung!$H$2:$I$6,2,FALSE)),\"0\",VLOOKUP(DSFA!H6,Risikoberechnung!$H$2:$I$6,2,FALSE))","v":"0"},{"$f":"DSFA!K6","v":"x"},{"$f":"IF(ISNA(VLOOKUP(DSFA!N6,Risikoberechnung!$H$2:$I$6,2,FALSE)),\"\",VLOOKUP(DSFA!N6,Risikoberechnung!$H$2:$I$6,2,FALSE))","v":""},{"$f":"IF(ISNA(VLOOKUP(DSFA!O6,Risikoberechnung!$H$2:$I$6,2,FALSE)),\"\",VLOOKUP(DSFA!O6,Risikoberechnung!$H$2:$I$6,2,FALSE))","v":""},{"$f":"DSFA!R6","v":"x"},null,"Eintrittswahrscheinlichkeit","hoch",{"$f":"IF(T4>0,\"X\",\"\")","v":""},{"$f":"IF(U4>0,\"X\",\"\")","v":""},{"$f":"IF(V4>0,\"X\",\"\")","v":""},{"$f":"IF(W4>0,\"X\",\"\")","v":""},{"$nulls":3},"Eintrittswahrscheinlichkeit","hoch",{"$f":"Risikomatrix2!C3","v":0},{"$f":"Risikomatrix2!D3","v":0},{"$f":"Risikomatrix2!E3","v":0},{"$f":"Risikomatrix2!F3","v":0}]
[{"$f":"DSFA!A7","v":2},{"$f":"IF(ISNA(VLOOKUP(DSFA!G7,Risikoberechnung!$H$2:$I$5,2,FALSE)),\"\",VLOOKUP(DSFA!G7,Risikoberechnung!$H$2:$I$5,2,FALSE))","v":""},{"$f":"IF(ISNA(VLOOKUP(DSFA!H7,Risikoberechnung!$H$2:$I$6,2,FALSE)),\"0\",VLOOKUP(DSFA!H7,Risikoberechnung!$H$2:$I$6,2,FALSE))","v":"0"},{"$f":"DSFA!K7","v":"x"},{"$f":"IF(ISNA(VLOOKUP(DSFA!N7,Risikoberechnung!$H$2:$I$6,2,FALSE)),\"\",VLOOKUP(DSFA!N7,Risikoberechnung!$H$2:$I$6,2,FALSE))","v":""},{"$f":"IF(ISNA(VLOOKUP(DSFA!O7,Risikoberechnung!$H$2:$I$6,2,FALSE)),\"\",VLOOKUP(DSFA!O7,Risikoberechnung!$H$2:$I$6,2,FALSE))","v":""},{"$f":"DSFA!R7","v":"x"},{"$nulls":8},"Kein Risiko","x"]
[{"$f":"DSFA!A8","v":3},{"$f":"IF(ISNA(VLOOKUP(DSFA!G8,Risikoberechnung!$H$2:$I$5,2,FALSE)),\"\",VLOOKUP(DSFA!G8,Risikoberechnung!$H$2:$I$5,2,FALSE))","v":""},{"$f":"IF(ISNA(VLOOKUP(DSFA!H8,Risikoberechnung!$H$2:$I$6,2,FALSE)),\"0\",VLOOKUP(DSFA!H8,Risikoberechnung!$H$2:$I$6,2,FALSE))","v":"0"},{"$f":"DSFA!K8","v":"x"},{"$f":"IF(ISNA(VLOOKUP(DSFA!N8,Risikoberechnung!$H$2:$I$6,2,FALSE)),\"\",VLOOKUP(DSFA!N8,Risikoberechnung!$H$2:$I$6,2,FALSE))","v":""},{"$f":"IF(ISNA(VLOOKUP(DSFA!O8,Risikoberechnung!$H$2:$I$6,2,FALSE)),\"\",VLOOKUP(DSFA!O8,Risikoberechnung!$H$2:$I$6,2,FALSE))","v":""},{"$f":"DSFA!R8","v":"x"},{"$nulls":8},"Voraussichtlich kein Risiko","x"]
[{"$f":"DSFA!A9","v":4},{"$f":"IF(ISNA(VLOOKUP(DSFA!G9,Risikoberechnung!$H$2:$I$5,2,FALSE)),\"\",VLOOKUP(DSFA!G9,Risikoberechnung!$H$2:$I$5,2,FALSE))","v":""},{"$f":"IF(ISNA(VLOOKUP(DSFA!H9,Risikoberechnung!$H$2:$I$6,2,FALSE)),\"0\",VLOOKUP(DSFA!H9,Risikoberechnung!$H$2:$I$6,2,FALSE))","v":"0"},{"$f":"DSFA!K9","v":"x"},{"$f":"IF(ISNA(VLOOKUP(DSFA!N9,Risikoberechnung!$H$2:$I$6,2,FALSE)),\"\",VLOOKUP(DSFA!N9,Risikoberechnung!$H$2:$I$6,2,FALSE))","v":""},{"$f":"IF(ISNA(VLOOKUP(DSFA!O9,Risikoberechnung!$H$2:$I$6,2,FALSE)),\"\",VLOOKUP(DSFA!O9,Risikoberechnung!$H$2:$I$6,2,FALSE))","v":""},{"$f":"DSFA!R9","v":"x"},null,null,"mittel",{"$f":"IF(T7>0,\"X\",\"\")","v":""},{"$f":"IF(U7>0,\"X\",\"\")","v":""},{"$f":"IF(V7>0,\"X\",\"\")","v":""},{"$f":"IF(W7>0,\"X\",\"\")","v":""},null,"(Normales) Risiko","x",null,"mittel",{"$f":"Risikomatrix2!C4","v":0},{"$f":"Risikomatrix2!D4","v":0},{"$f":"Risikomatrix2!E4","v":0},{"$f":"Risikomatrix2!F4","v":0}]
[{"$f":"DSFA!A10","v":5},{"$f":"IF(ISNA(VLOOKUP(DSFA!G10,Risikoberechnung!$H$2:$I$5,2,FALSE)),\"\",VLOOKUP(DSFA!G10,Risikoberechnung!$H$2:$I$5,2,FALSE))","v":""},{"$f":"IF(ISNA(VLOOKUP(DSFA!H10,Risikoberechnung!$H$2:$I$6,2,FALSE)),\"0\",VLOOKUP(DSFA!H10,Risikoberechnung!$H$2:$I$6,2,FALSE))","v":"0"},{"$f":"DSFA!K10","v":"x"},{"$f":"IF(ISNA(VLOOKUP(DSFA!N10,Risikoberechnung!$H$2:$I$6,2,FALSE)),\"\",VLOOKUP(DSFA!N10,Risikoberechnung!$H$2:$I$6,2,FALSE))","v":""},{"$f":"IF(ISNA(VLOOKUP(DSFA!O10,Risikoberechnung!$H$2:$I$6,2,FALSE)),\"\",VLOOKUP(DSFA!O10,Risikoberechnung!$H$2:$I$6,2,FALSE))","v":""},{"$f":"DSFA!R10","v":"x"},{"$nulls":8},"Erhebliches Risiko","x"]
[{"$f":"DSFA!A11","v":6},{"$f":"IF(ISNA(VLOOKUP(DSFA!G11,Risikoberechnung!$H$2:$I$5,2,FALSE)),\"\",VLOOKUP(DSFA!G11,Risikoberechnung!$H$2:$I$5,2,FALSE))","v":""},{"$f":"IF(ISNA(VLOOKUP(DSFA!H11,Risikoberechnung!$H$2:$I$6,2,FALSE)),\"0\",VLOOKUP(DSFA!H11,Risikoberechnung!$H$2:$I$6,2,FALSE))","v":"0"},{"$f":"DSFA!K11","v":"x"},{"$f":"IF(ISNA(VLOOKUP(DSFA!N11,Risikoberechnung!$H$2:$I$6,2,FALSE)),\"\",VLOOKUP(DSFA!N11,Risikoberechnung!$H$2:$I$6,2,FALSE))","v":""},{"$f":"IF(ISNA(VLOOKUP(DSFA!O11,Risikoberechnung!$H$2:$I$6,2,FALSE)),\"\",VLOOKUP(DSFA!O11,Risikoberechnung!$H$2:$I$6,2,FALSE))","v":""},{"$f":"DSFA!R11","v":"x"},{"$nulls":8},"Hohes Risiko","x"]
[{"$f":"DSFA!A12","v":7},{"$f":"IF(ISNA(VLOOKUP(DSFA!G12,Risikoberechnung!$H$2:$I$5,2,FALSE)),\"\",VLOOKUP(DSFA!G12,Risikoberechnung!$H$2:$I$5,2,FALSE))","v":""},{"$f":"IF(ISNA(VLOOKUP(DSFA!H12,Risikoberechnung!$H$2:$I$6,2,FALSE)),\"0\",VLOOKUP(DSFA!H12,Risikoberechnung!$H$2:$I$6,2,FALSE))","v":"0"},{"$f":"DSFA!K12","v":"x"},{"$f":"IF(ISNA(VLOOKUP(DSFA!N12,Risikoberechnung!$H$2:$I$6,2,FALSE)),\"\",VLOOKUP(DSFA!N12,Risikoberechnung!$H$2:$I$6,2,FALSE))","v":""},{"$f":"IF(ISNA(VLOOKUP(DSFA!O12,Risikoberechnung!$H$2:$I$6,2,FALSE)),\"\",VLOOKUP(DSFA!O12,Risikoberechnung!$H$2:$I$6,2,FALSE))","v":""},{"$f":"DSFA!R12","v":"x"},null,null,"niedrig",{"$f":"IF(T10>0,\"X\",\"\")","v":""},{"$f":"IF(U10>0,\"X\",\"\")","v":""},{"$f":"IF(V10>0,\"X\",\"\")","v":""},{"$f":"IF(W10>0,\"X\",\"\")","v":""},null,"Untragbares Risiko","x",null,"niedrig",{"$f":"Risikomatrix2!C5","v":0},{"$f":"Risikomatrix2!D5","v":0},{"$f":"Risikomatrix2!E5","v":0},{"$f":"Risikomatrix2!F5","v":0}]
{"$rows_left_out":131}
{"sheet":"Risikomatrix2","index":3,"n_rows":19,"n_cols":6,"rows_kept":19,"hidden":true,"merged":[[0,1,1,1],[0,2,0,5],[2,0,4,0],[7,0,8,1],[7,2,7,5],[9,0,11,0],[14,0,15,1],[14,2,14,5],[16,0,18,0]]}
[null,{"$f":"DSFA!G2","v":"Riskoanalyse VOR Maßnahmenfestlegung"},"Schadenshöhe"]
[null,null,"Niedrig","Normal","Hoch","Sehr hoch"]
["Eintrittswahrscheinlichkeit","Hoch",{"$f":"SUMIF(DSFA!$J$6:$J$142,CONCATENATE($C$2,B3),DSFA!$V$6:$V$142)","v":0},{"$f":"SUMIF(DSFA!$J$6:$J$142,CONCATENATE($D$2,B3),DSFA!$V$6:$V$142)","v":0},{"$f":"SUMIF(DSFA!$J$6:$J$142,CONCATENATE($E$2,B3),DSFA!$V$6:$V$142)","v":0},{"$f":"SUMIF(DSFA!$J$6:$J$142,CONCATENATE($F$2,B3),DSFA!$V$6:$V$142)","v":0}]
[null,"Mittel",{"$f":"SUMIF(DSFA!$J$6:$J$142,CONCATENATE($C$2,B4),DSFA!$V$6:$V$142)","v":0},{"$f":"SUMIF(DSFA!$J$6:$J$142,CONCATENATE($D$2,B4),DSFA!$V$6:$V$142)","v":0},{"$f":"SUMIF(DSFA!$J$6:$J$142,CONCATENATE($E$2,B4),DSFA!$V$6:$V$142)","v":0},{"$f":"SUMIF(DSFA!$J$6:$J$142,CONCATENATE($F$2,B4),DSFA!$V$6:$V$142)","v":0}]
[null,"Niedrig",{"$f":"SUMIF(DSFA!$J$6:$J$142,CONCATENATE($C$2,B5),DSFA!$V$6:$V$142)","v":0},{"$f":"SUMIF(DSFA!$J$6:$J$142,CONCATENATE($D$2,B5),DSFA!$V$6:$V$142)","v":0},{"$f":"SUMIF(DSFA!$J$6:$J$142,CONCATENATE($E$2,B5),DSFA!$V$6:$V$142)","v":0},{"$f":"SUMIF(DSFA!$J$6:$J$142,CONCATENATE($F$2,B5),DSFA!$V$6:$V$142)","v":0}]
[]
[]
[{"$f":"DSFA!N2","v":"Riskoanalyse NACH Maßnahmenfestlegung"},null,"Schadenshöhe"]
[null,null,"Niedrig","Normal","Hoch","Sehr hoch"]
["Eintrittswahrscheinlichkeit","Hoch",{"$f":"SUMIF(DSFA!$Q$6:$Q$142,CONCATENATE($C$9,B10),DSFA!$V$6:$V$142)","v":0},{"$f":"SUMIF(DSFA!$Q$6:$Q$142,CONCATENATE($D$9,B10),DSFA!$V$6:$V$142)","v":0},{"$f":"SUMIF(DSFA!$Q$6:$Q$142,CONCATENATE($E$9,B10),DSFA!$V$6:$V$142)","v":0},{"$f":"SUMIF(DSFA!$Q$6:$Q$142,CONCATENATE($F$9,B10),DSFA!$V$6:$V$142)","v":0}]
{"$rows_left_out":10}
{"sheet":"Risikoanalyse","index":4,"n_rows":43,"n_cols":5,"rows_kept":43,"hidden":true}
[]
["Schadenshöhe","Risiken für den Betroffenen"]
["Niedrig","Betroffene werden nicht belangt oder könnten auf ein paar Unannehmlichkeiten treffe, welche sie problemlos bewältigen können (Zeitbedarf zur Wiedereingabe von Information, Verärgerung, Irritationen, leichte Verletzung, die nicht mehr als Erste Hilfe erfordert usw.)"]
["Normal","Betroffene können bedeutende Unbequemlichkeiten erfahren, welche sie trotz einiger weniger Schwierigkeiten bewältigen können (zusätzliche Kosten, Ablehnung beim Zugang zu kommerziellen Diensten, Angst, mangelndes Verständnis, Stress, kleine körperliche Gebrechen,Verletzungen oder Krankheiten, die mehr als Erste Hilfe erfordern)"]
["Hoch","Betroffene könnten bedeutende Konsequenzen erfahren, welche sie trotz ernsthafter Schwierigkeiten zu bewältigen in der Lage sein sollten (fehlgeleitete Zahlungsmittel, Verlust der Kreditwürdigkeit, Eigentumsschaden, Arbeitsplatzverlust, Vorladung, schwere, lähmende Verletzung oder Krankheit usw.)"]
["Sehr hoch","Betroffene könnten erhebliche oder sogar unumkehrbare Konsequenzen erfahren, welche sie nicht bewältigen könnten (finanz. Notlage, uneinbringl. Schulden oder Arbeitsunfähigkeit, langfristige psychologische oder physische Gebrechen, Tod usw.)"]
[]
[]
["Eintrittswahrscheinlichkeit"]
["Niedrig"]
{"$rows_left_out":34}
{"sheet":"Risiken","index":5,"n_rows":31,"n_cols":1,"rows_kept":31,"hidden":true}
["Risiken"]
["Bitte auswählen"]
["Anderen erheblichen wirtschaftlichen oder gesellschaftlichen Nachteilen"]
["Arbeitsrechtlicher Kontext"]
["Auftauchen (negativer) Informationen (Informationsemergenz)"]
["Behandlung des Menschen als bloßes Objekt"]
["Bildung eines Persönlichkeitsprofils"]
["Bonitätsprüfungen, Forderungsmanagement"]
["Dauerhafte Verfügbarkeit (negativer) Informationen"]
["Diskriminierung"]
{"$rows_left_out":22}
{"sheet":"Risikobeispiele","index":6,"n_rows":53,"n_cols":1,"rows_kept":53,"hidden":true}
["Risikobeispiele"]
["Bitte auswählen"]
["Abfangen kompromittierender Strahlung"]
["Abhören"]
["Abstreiten von Handlungen"]
["Anschlag"]
["Ausfall oder Störung der Stromversorgung"]
["Ausfall oder Störung von Dienstleistern"]
["Ausfall oder Störung von Kommunikationsnetzen"]
["Ausfall oder Störung von Versorgungsnetzen"]
{"$rows_left_out":44}
{"sheet":"Risikoquellen","index":7,"n_rows":43,"n_cols":1,"rows_kept":43,"hidden":true}
["Risikoquellen"]
["Bitte auswählen"]
["Auftragsverarbeiter"]
["Beschäftigter, Fahrlässigkeit"]
["Beschäftigter, Finanzieller Vorteil"]
["Beschäftigter, Spionage"]
["Beschäftigter, Übermüdung/Überlastung"]
["Beschäftigter, Vergeltung/Rache"]
["Beschäftigter, Vorsatz"]
["Beschäftigter, Weggang/Verlassen der Firma"]
{"$rows_left_out":34}
{"sheet":"Risikobewältigung","index":8,"n_rows":7,"n_cols":1,"rows_kept":7,"hidden":true}
["R-Bewältigung"]
["Bitte auswählen"]
["Risikovermeidung"]
["Risikominimierung"]
["Risikohandhabung"]
["Risikoübertragung"]
["mehrere"]

{"sheet":"Maßnahmen","index":9,"n_rows":38,"n_cols":1,"rows_kept":38,"hidden":true}
["Maßnahmen"]
["Bitte auswählen"]
["Komplexe Darstellung erforderlich, externes Dokument, zu finden: (bitte Angabe Speicherort)"]
["Pseudonymisierung / Nichtangabe"]
["Pseudonymisierung / Maskierung / Ersetzung"]
["Pseudonymisierung / Mischung / Shuffeling"]
["Pseudonymisierung / Varianzmethode"]
["Pseudonymisierung / Weitere Maßnahme"]
["Verschlüsselung / Blockchiffren"]
["Verschlüsselung / Stromchiffren"]
{"$rows_left_out":29}
{"sheet":"Ergebnis","index":10,"n_rows":5,"n_cols":3,"rows_kept":5,"hidden":true}
["Ergebnis"]
["DSFA",null,"Maßnahme"]
["Bitte auswählen",null,"Bitte auswählen"]
["Aufsichtsbehörde konsultieren",null,"Restrisiko akzeptabel"]
["Verarbeitung statthaft",null,"Weitere Maßnahmen erforderlich"]

{"sheet":"Risikoberechnung","index":11,"n_rows":28,"n_cols":9,"rows_kept":28,"hidden":true}
["Risikobewertung"]
["NiedrigNiedrig",1,null,1,"Kein Risiko",{"$f":"1*0.5","v":0.5},null,"Niedrig",0.5]
["NiedrigMittel",2,null,2,"Voraussichtlich kein Risiko",1.5,null,"Normal",1.5]
["NiedrigHoch",3,null,3,"(Normales) Risiko",2.5,null,"Hoch",2.5]
["NormalNiedrig",2,null,4,"Erhebliches Risiko",3.5,null,"Sehr hoch",3.5]
["NormalMittel",3,null,5,"Hohes Risiko",4.5,null,"Mittel",1.5]
["NormalHoch",4,null,6,"untragbares Risiko",5.5]
["HochNiedrig",4]
["HochMittel",5]
["HochHoch",6]
{"$rows_left_out":19}
{"sheet":"Ausfüllhilfen","index":12,"n_rows":5,"n_cols":3,"rows_kept":5,"hidden":true}
["Ja/Nein-Felder",null,"Risikoursprung"]
["Nein",null,"Allgemein"]
["Ja",null,"Aufnahme"]
[null,null,"Behandlung"]
[null,null,"Abrechnung"]